ID,Cohort,Cell/Tissue,Age,Gender,Sentrix ID,Sentrix Position,barcode,Cell Type,Age Group,Predicted Male Probability,Predicted Gender,Genome-wide methylation,predicted_ages,age_increase,Immune Cell Content (LUMP)
GSM2333901,Johansson et al.,whole blood,72,male,9370847096,R05C02,9370847096_R05C02,,senior,0.9999995700032,male,0.523760365049331,68.5389975669387,-3.46100243306131,0.987572343322493
GSM2333902,Johansson et al.,whole blood,55,male,9376538120,R06C01,9376538120_R06C01,,,0.999998853667411,male,0.528169894663081,47.1424837006306,-7.85751629936937,0.987679131126307
GSM2333903,Johansson et al.,whole blood,23,male,7766148053,R06C02,7766148053_R06C02,,young,0.999999390635705,male,0.522463152638691,16.579942602508,-6.42005739749204,0.989461493667392
GSM2333904,Johansson et al.,whole blood,86,male,7766148077,R04C02,7766148077_R04C02,,senior,0.999995062381333,male,0.525284387870685,76.9500225527909,-9.04997744720909,0.990524383055143
GSM2333905,Johansson et al.,whole blood,74,male,9370847096,R06C02,9370847096_R06C02,,senior,0.999999207415583,male,0.522985319787487,64.5105476394709,-9.4894523605291,0.987691319260505
GSM2333906,Johansson et al.,whole blood,76,female,7766148116,R01C02,7766148116_R01C02,,senior,4.86159516289936e-09,female,0.520004511735517,71.4540062062657,-4.54599379373431,0.990645126275046
GSM2333907,Johansson et al.,whole blood,18,male,7766148116,R06C01,7766148116_R06C01,,young,0.999998968530994,male,0.525598008101881,16.3019583103651,-1.69804168963489,0.989199071870381
GSM2333908,Johansson et al.,whole blood,38,male,9376538120,R01C02,9376538120_R01C02,,,0.999963576122704,male,0.510332486712391,32.249810810371,-5.75018918962898,0.985814751609257
GSM2333909,Johansson et al.,whole blood,33,female,9379082138,R01C01,9379082138_R01C01,,,1.70809867530324e-08,female,0.514175805336774,31.1019233050634,-1.89807669493665,0.987797635421642
GSM2333910,Johansson et al.,whole blood,34,female,9379082138,R02C01,9379082138_R02C01,,,8.2213031839347e-09,female,0.518572871065473,30.6599562879881,-3.34004371201194,0.988383820050231
GSM2333911,Johansson et al.,whole blood,86,female,7766148077,R03C02,7766148077_R03C02,,senior,1.19150996826575e-09,female,0.522738593907426,82.0954800453529,-3.9045199546471,0.989730982138412
GSM2333912,Johansson et al.,whole blood,18,female,7766148116,R02C02,7766148116_R02C02,,young,1.56455034537082e-09,female,0.52557832312852,13.191647066878,-4.80835293312203,0.989541818912283
GSM2333913,Johansson et al.,whole blood,65,male,7766148025,R02C02,7766148025_R02C02,,,0.999992891917593,male,0.519727970100162,59.2875648664197,-5.71243513358035,0.990347398560681
GSM2333914,Johansson et al.,whole blood,55,male,7766148058,R01C01,7766148058_R01C01,,,0.999989319682943,male,0.515979217247696,56.5061916349824,1.5061916349824,0.987655727215379
GSM2333915,Johansson et al.,whole blood,65,female,7766148025,R03C02,7766148025_R03C02,,,4.19181400770844e-10,female,0.523545444361381,55.1878988049407,-9.81210119505928,0.989596076985688
GSM2333916,Johansson et al.,whole blood,59,male,9370847091,R05C01,9370847091_R05C01,,,0.999998767647794,male,0.531451010279579,48.18101441353,-10.81898558647,0.986348559037497
GSM2333917,Johansson et al.,whole blood,80,female,7766148025,R04C02,7766148025_R04C02,,senior,1.94444554969881e-10,female,0.523405162199717,71.2436690130588,-8.75633098694118,0.989681185014415
GSM2333918,Johansson et al.,whole blood,60,male,7766148058,R02C01,7766148058_R02C01,,,0.999994944409295,male,0.519946472577828,50.4779911523898,-9.52200884761017,0.989285936814841
GSM2333919,Johansson et al.,whole blood,55,female,7766148025,R05C02,7766148025_R05C02,,,1.34486802897981e-11,female,0.530615921259234,49.0988600953646,-5.90113990463539,0.990004921937775
GSM2333920,Johansson et al.,whole blood,63,male,9370847091,R06C01,9370847091_R06C01,,,0.999999384229206,male,0.534874343267626,53.2040781211768,-9.79592187882323,0.986903777743845
GSM2333921,Johansson et al.,whole blood,29,male,7766148058,R03C01,7766148058_R03C01,,young,0.99999822972162,male,0.525690699472475,23.211108947041,-5.78889105295904,0.989776323517017
GSM2333922,Johansson et al.,whole blood,68,female,7766148025,R06C02,7766148025_R06C02,,senior,2.16625008326696e-11,female,0.526971059704091,65.3867142188342,-2.61328578116576,0.99090649263462
GSM2333923,Johansson et al.,whole blood,22,male,9370847091,R01C02,9370847091_R01C02,,young,0.999982783743879,male,0.510671592685964,15.8680593015933,-6.13194069840669,0.987677197527391
GSM2333924,Johansson et al.,whole blood,16,female,7766148030,R03C01,7766148030_R03C01,,young,1.4252059943274e-09,female,0.525151734412174,10.3566720501862,-5.64332794981384,0.99048021664779
GSM2333925,Johansson et al.,whole blood,75,female,9370847011,R01C01,9370847011_R01C01,,senior,1.43711807331632e-07,female,0.510243273525593,63.4380385127977,-11.5619614872023,0.988349938635089
GSM2333926,Johansson et al.,whole blood,16,male,7766148030,R04C01,7766148030_R04C01,,young,0.999994953162776,male,0.523478031968345,13.0125466613148,-2.98745333868522,0.991753935462529
GSM2333927,Johansson et al.,whole blood,74,female,9370847011,R02C01,9370847011_R02C01,,senior,2.77848426022543e-06,female,0.51564810291612,58.6883510658835,-15.3116489341165,0.987818836498455
GSM2333928,Johansson et al.,whole blood,63,female,9370847081,R06C02,9370847081_R06C02,,,1.6213863619424e-08,female,0.545289476758771,62.715835542338,-0.284164457662023,0.985532186008823
GSM2333929,Johansson et al.,whole blood,38,female,9370847011,R03C01,9370847011_R03C01,,,4.65073980036996e-09,female,0.520301485202683,35.4919382933671,-2.50806170663292,0.98976831856569
GSM2333930,Johansson et al.,whole blood,64,female,7766148030,R05C01,7766148030_R05C01,,,2.34884708969231e-10,female,0.525457075746659,56.628147422577,-7.37185257742299,0.991251989463413
GSM2333931,Johansson et al.,whole blood,68,female,7766148030,R06C01,7766148030_R06C01,,senior,2.15385646310729e-11,female,0.533424304944907,60.2584464122178,-7.74155358778219,0.991610996641328
GSM2333932,Johansson et al.,whole blood,45,female,7766148030,R01C02,7766148030_R01C02,,,3.30952615389084e-07,female,0.524906626313155,37.9015598402098,-7.09844015979016,0.992132864610278
GSM2333933,Johansson et al.,whole blood,80,male,9370847011,R04C01,9370847011_R04C01,,senior,0.999968657337789,male,0.533899508006163,69.9841895836073,-10.0158104163927,0.988647801940354
GSM2333934,Johansson et al.,whole blood,46,female,9370847063,R03C02,9370847063_R03C02,,,6.78770622675126e-09,female,0.521725114084821,39.118720784211,-6.88127921578903,0.989875250515945
GSM2333935,Johansson et al.,whole blood,82,male,7766148114,R02C01,7766148114_R02C01,,senior,0.999870712190267,male,0.514749760007975,74.8716971025115,-7.12830289748851,0.989796428971152
GSM2333936,Johansson et al.,whole blood,58,female,9370847063,R04C02,9370847063_R04C02,,,7.21688548545029e-10,female,0.527878292818826,48.7448053980628,-9.25519460193721,0.989044776299072
GSM2333937,Johansson et al.,whole blood,69,female,7766148114,R03C01,7766148114_R03C01,,senior,1.62460786838486e-10,female,0.522918156038519,63.1656548897543,-5.83434511024567,0.988648574591613
GSM2333938,Johansson et al.,whole blood,23,female,7766148005,R05C02,7766148005_R05C02,,young,5.18684818221938e-10,female,0.528211446134195,21.2476424395773,-1.75235756042268,0.990214465453072
GSM2333939,Johansson et al.,whole blood,59,female,9370847063,R05C02,9370847063_R05C02,,,1.32516809541693e-10,female,0.531087254858185,49.0083047439118,-9.99169525608817,0.98946959370698
GSM2333940,Johansson et al.,whole blood,79,male,7766148005,R06C02,7766148005_R06C02,,senior,0.999995847773502,male,0.529289842265506,75.5612279097712,-3.43877209022884,0.990153897639585
GSM2333941,Johansson et al.,whole blood,66,male,7766148114,R04C01,7766148114_R04C01,,senior,0.999999063564052,male,0.524090492469058,64.1298655095355,-1.87013449046451,0.98922643365706
GSM2333942,Johansson et al.,whole blood,71,female,7766148114,R01C01,7766148114_R01C01,,senior,3.78846883400793e-09,female,0.52129704874495,65.8945525164794,-5.10544748352061,0.989964945825926
GSM2333943,Johansson et al.,whole blood,55,female,9370847063,R06C02,9370847063_R06C02,,,6.64303117944841e-10,female,0.535729277310328,47.5936674721445,-7.40633252785548,0.988389640792385
GSM2333944,Johansson et al.,whole blood,62,male,7512551037,R01C01,7512551037_R01C01,,,0.999990626046243,male,0.523239459449547,53.6756458383252,-8.3243541616748,0.99150359674923
GSM2333945,Johansson et al.,whole blood,57,female,9370847125,R01C01,9370847125_R01C01,,,3.10891230031636e-07,female,0.510990420106882,47.5136531437026,-9.48634685629743,0.985983684405873
GSM2333946,Johansson et al.,whole blood,50,female,9370847125,R05C02,9370847125_R05C02,,,1.174072513339e-09,female,0.533709609895511,43.2251201893584,-6.77487981064158,0.987433729592426
GSM2333947,Johansson et al.,whole blood,48,male,7766148026,R06C01,7766148026_R06C01,,,0.999998687214896,male,0.527436603561153,40.0742071305656,-7.92579286943442,0.989761643053506
GSM2333948,Johansson et al.,whole blood,39,male,7766148026,R02C01,7766148026_R02C01,,,0.999995461438002,male,0.529249678535756,36.5431620026347,-2.45683799736533,0.990184235051152
GSM2333949,Johansson et al.,whole blood,81,female,9370847092,R01C01,9370847092_R01C01,,senior,5.54013347890828e-07,female,0.516850504567158,70.0820974980902,-10.9179025019098,0.986199807511495
GSM2333950,Johansson et al.,whole blood,81,male,9370847125,R06C02,9370847125_R06C02,,senior,0.999998942731883,male,0.54644700018664,75.31930252578,-5.68069747422001,0.987295589200427
GSM2333951,Johansson et al.,whole blood,91,female,9370847092,R02C01,9370847092_R02C01,,senior,2.11414139998597e-07,female,0.5214928134628,72.2768667702281,-18.7231332297719,0.987450645798388
GSM2333952,Johansson et al.,whole blood,15,female,7766148026,R03C01,7766148026_R03C01,,young,1.34577722598152e-09,female,0.532913910601727,9.90801221587722,-5.09198778412278,0.990327846486424
GSM2333953,Johansson et al.,whole blood,57,female,7766148026,R01C02,7766148026_R01C02,,,5.13698662059022e-08,female,0.524837750139834,51.744834192812,-5.25516580718797,0.990577486259109
GSM2333954,Johansson et al.,whole blood,45,female,7766148026,R04C01,7766148026_R04C01,,,4.8846159716812e-10,female,0.528583052393965,44.0951545341693,-0.904845465830675,0.989528857978255
GSM2333955,Johansson et al.,whole blood,45,male,7766148026,R02C02,7766148026_R02C02,,,0.999994846016854,male,0.52180132098201,40.7581568867213,-4.2418431132787,0.990097315267635
GSM2333956,Johansson et al.,whole blood,28,male,7766148026,R05C01,7766148026_R05C01,,young,0.99999879836941,male,0.529057417373314,25.9252570292596,-2.07474297074044,0.989615068777074
GSM2333957,Johansson et al.,whole blood,37,female,7766148077,R06C01,7766148077_R06C01,,,1.00952969017457e-12,female,0.523013243846871,35.9001785800289,-1.09982141997112,0.989349644359021
GSM2333958,Johansson et al.,whole blood,69,male,9370847096,R04C02,9370847096_R04C02,,senior,0.999997819843874,male,0.524914624030157,57.5745928052374,-11.4254071947626,0.988194895834483
GSM2333959,Johansson et al.,whole blood,25,male,7766148077,R01C02,7766148077_R01C02,,young,0.999983134364669,male,0.525467103189372,18.8815679425822,-6.11843205741783,0.990452152138781
GSM2333960,Johansson et al.,whole blood,66,female,7766148116,R03C01,7766148116_R03C01,,senior,1.77480577460939e-10,female,0.525942870593733,60.003735326886,-5.99626467311404,0.989751253809429
GSM2333961,Johansson et al.,whole blood,22,female,7766148003,R06C02,7766148003_R06C02,,young,1.83736854765475e-11,female,0.526896546446361,18.1737133693774,-3.82628663062258,0.987610593781129
GSM2333962,Johansson et al.,whole blood,23,male,7766148077,R02C02,7766148077_R02C02,,young,0.999991986641502,male,0.523178995389942,13.89571431481,-9.10428568518999,0.989971697206264
GSM2333963,Johansson et al.,whole blood,17,male,7766148116,R01C01,7766148116_R01C01,,young,0.999991728827836,male,0.524202677511111,13.5806258664678,-3.41937413353216,0.989370791849999
GSM2333964,Johansson et al.,whole blood,17,male,7766148116,R04C01,7766148116_R04C01,,young,0.999998389715059,male,0.524207148168206,10.6103039913322,-6.38969600866779,0.990015202166816
GSM2333965,Johansson et al.,whole blood,21,male,7766148116,R02C01,7766148116_R02C01,,young,0.99998787115935,male,0.520767749089219,16.4489465572462,-4.55105344275382,0.989644409005432
GSM2333966,Johansson et al.,whole blood,82,male,9376538120,R05C01,9376538120_R05C01,,senior,0.999981484611586,male,0.520736132944461,67.6168705050241,-14.3831294949759,0.988589985320768
GSM2333967,Johansson et al.,whole blood,62,female,9370847096,R03C02,9370847096_R03C02,,,2.04716652028701e-10,female,0.51344998836191,50.626806729175,-11.373193270825,0.988573284808005
GSM2333968,Johansson et al.,whole blood,68,male,7766148116,R05C01,7766148116_R05C01,,senior,0.999995641912238,male,0.53600155925692,62.2793594437802,-5.72064055621983,0.988939219885191
GSM2333969,Johansson et al.,whole blood,45,male,7766148114,R05C01,7766148114_R05C01,,,0.999999292659055,male,0.530994219931032,43.5674714207137,-1.43252857928631,0.989294687961077
GSM2333970,Johansson et al.,whole blood,42,male,7766148114,R02C02,7766148114_R02C02,,,0.999997130525078,male,0.520072199706923,38.5901443503322,-3.40985564966776,0.988127893542349
GSM2333971,Johansson et al.,whole blood,68,male,9370847125,R02C01,9370847125_R02C01,,senior,0.999978380486863,male,0.525474574736383,55.5012782711102,-12.4987217288898,0.984807240046618
GSM2333972,Johansson et al.,whole blood,40,female,9370847125,R04C01,9370847125_R04C01,,,3.50380015029384e-09,female,0.529871181682815,35.3746648613488,-4.62533513865119,0.988784745168341
GSM2333973,Johansson et al.,whole blood,44,male,9376561015,R05C02,9376561015_R05C02,,,0.999999464177291,male,0.51754440377166,38.4484481838755,-5.55155181612445,0.988450167315449
GSM2333974,Johansson et al.,whole blood,22,female,7766148114,R03C02,7766148114_R03C02,,young,1.55355868853456e-10,female,0.519818651759824,19.1140380361283,-2.88596196387173,0.988239861596881
GSM2333975,Johansson et al.,whole blood,23,male,7766148114,R06C01,7766148114_R06C01,,young,0.999999732771672,male,0.533613956959934,16.838087213533,-6.16191278646702,0.990395085204258
GSM2333976,Johansson et al.,whole blood,25,female,9370847125,R05C01,9370847125_R05C01,,young,7.88791034652998e-10,female,0.531263743706233,17.9911111055579,-7.00888889444206,0.988095639263849
GSM2333977,Johansson et al.,whole blood,45,female,7766148114,R01C02,7766148114_R01C02,,,5.02999822276932e-09,female,0.527011063042572,40.0995767764158,-4.90042322358422,0.988919099923457
GSM2333978,Johansson et al.,whole blood,40,male,9370847125,R06C01,9370847125_R06C01,,,0.999998745134499,male,0.532662088319365,27.2502356657649,-12.7497643342351,0.987301752683393
GSM2333979,Johansson et al.,whole blood,81,female,9370847125,R03C01,9370847125_R03C01,,senior,1.95233563173224e-08,female,0.525350970573573,70.3398734366892,-10.6601265633108,0.986362869169232
GSM2333980,Johansson et al.,whole blood,32,female,9370847011,R02C02,9370847011_R02C02,,,7.96979887570554e-09,female,0.512223854642662,28.4947835075822,-3.50521649241784,0.988727616884783
GSM2333981,Johansson et al.,whole blood,28,female,9370847011,R03C02,9370847011_R03C02,,young,2.77960167545973e-09,female,0.522049611121328,19.6208142345968,-8.37918576540322,0.989719046257398
GSM2333982,Johansson et al.,whole blood,19,female,7766148112,R05C01,7766148112_R05C01,,young,3.18686799185985e-12,female,0.519867298225501,13.5469553908505,-5.4530446091495,0.990105286315014
GSM2333983,Johansson et al.,whole blood,16,female,7766148077,R03C01,7766148077_R03C01,,young,2.60050826560414e-10,female,0.522895542069846,12.4866526542246,-3.51334734577541,0.989674081093037
GSM2333984,Johansson et al.,whole blood,18,female,7766148112,R06C01,7766148112_R06C01,,young,1.4894590105011e-11,female,0.516439995897337,13.8659617172499,-4.13403828275015,0.99079352482503
GSM2333985,Johansson et al.,whole blood,19,male,7766148112,R04C02,7766148112_R04C02,,young,0.999998147982776,male,0.520047990508641,14.4269295449152,-4.57307045508479,0.98949750522
GSM2333986,Johansson et al.,whole blood,18,female,7766148112,R01C02,7766148112_R01C02,,young,1.38360534620654e-08,female,0.514974466737083,14.9085363290962,-3.09146367090379,0.989905656071433
GSM2333987,Johansson et al.,whole blood,18,male,9370847011,R04C02,9370847011_R04C02,,young,0.999998119927431,male,0.521258253242486,11.874312088394,-6.12568791160603,0.990029459885175
GSM2333988,Johansson et al.,whole blood,18,female,7766148112,R02C02,7766148112_R02C02,,young,2.13864837987913e-09,female,0.516441174325256,16.2734723692837,-1.72652763071634,0.989981478098356
GSM2333989,Johansson et al.,whole blood,18,male,7766148112,R05C02,7766148112_R05C02,,young,0.999998579565514,male,0.519971361769886,13.2681728416919,-4.73182715830809,0.989840673031339
GSM2333990,Johansson et al.,whole blood,17,female,7766148112,R03C02,7766148112_R03C02,,young,1.199794478234e-10,female,0.5227392468481,11.9016793353289,-5.09832066467113,0.990254315281606
GSM2333991,Johansson et al.,whole blood,82,female,9370847011,R05C02,9370847011_R05C02,,senior,3.00974311084542e-10,female,0.526331832912925,88.2550413853056,6.25504138530565,0.989247384213066
GSM2333992,Johansson et al.,whole blood,35,female,7766148030,R02C02,7766148030_R02C02,,,9.44616347964825e-09,female,0.519942165911967,31.0452248450331,-3.95477515496686,0.991698290804646
GSM2333993,Johansson et al.,whole blood,39,female,9370847011,R06C01,9370847011_R06C01,,,8.08878324170417e-11,female,0.521879369848208,35.8985831813134,-3.10141681868656,0.988129375679557
GSM2333994,Johansson et al.,whole blood,49,female,7766148030,R03C02,7766148030_R03C02,,,6.62644271289212e-09,female,0.527882877968725,42.0576455553073,-6.94235444469266,0.991279202233706
GSM2333995,Johansson et al.,whole blood,45,male,7766148112,R01C01,7766148112_R01C01,,,0.999990517033049,male,0.521226288659119,40.4583524755804,-4.54164752441963,0.988895577161789
GSM2333996,Johansson et al.,whole blood,42,female,7766148030,R04C02,7766148030_R04C02,,,7.77978506446824e-10,female,0.52371812980464,36.3041188185973,-5.6958811814027,0.990708657622194
GSM2333997,Johansson et al.,whole blood,18,male,7766148112,R02C01,7766148112_R02C01,,young,0.999995544683603,male,0.514077183458982,11.6356366725577,-6.36436332744229,0.989516712217021
GSM2333998,Johansson et al.,whole blood,32,female,9370847011,R05C01,9370847011_R05C01,,,1.04018063403863e-10,female,0.52598784379232,21.8907392655071,-10.1092607344929,0.988154654092829
GSM2333999,Johansson et al.,whole blood,18,male,9370847011,R01C02,9370847011_R01C02,,young,0.999967906407248,male,0.511648879689309,12.912293544237,-5.087706455763,0.988807071154148
GSM2334000,Johansson et al.,whole blood,40,female,7766148030,R05C02,7766148030_R05C02,,,6.28300752451816e-10,female,0.519809102318074,38.798671931839,-1.201328068161,0.99119115029796
GSM2334001,Johansson et al.,whole blood,43,female,7766148112,R03C01,7766148112_R03C01,,,4.0802224197206e-11,female,0.52101237269017,38.9573562226921,-4.04264377730794,0.990375551654684
GSM2334002,Johansson et al.,whole blood,44,female,7766148030,R06C02,7766148030_R06C02,,,1.25237338159412e-11,female,0.527580321344808,44.1981698064811,0.198169806481076,0.99080317472363
GSM2334003,Johansson et al.,whole blood,46,male,7766148112,R04C01,7766148112_R04C01,,,0.999999113352688,male,0.51949399925638,42.3475017230366,-3.65249827696342,0.98977354642571
GSM2334004,Johansson et al.,whole blood,79,female,9376538120,R02C01,9376538120_R02C01,,senior,1.25429236856589e-07,female,0.522008345781932,67.3406744965449,-11.6593255034551,0.985633329034475
GSM2334005,Johansson et al.,whole blood,71,male,9376538120,R03C01,9376538120_R03C01,,senior,0.999994030342476,male,0.527105678806974,58.8383670843806,-12.1616329156194,0.987451191352595
GSM2334006,Johansson et al.,whole blood,70,female,7766148120,R03C01,7766148120_R03C01,,senior,7.64313885626687e-10,female,0.522926670477885,64.1694760650179,-5.8305239349821,0.991058571574113
GSM2334007,Johansson et al.,whole blood,68,female,9370847081,R06C01,9370847081_R06C01,,senior,2.72718946763288e-10,female,0.534414402292229,56.0409842507194,-11.9590157492806,0.985789292094182
GSM2334008,Johansson et al.,whole blood,41,male,9370847081,R04C01,9370847081_R04C01,,,0.99999739871868,male,0.527817221235814,32.4039499628286,-8.59605003717142,0.987628130669557
GSM2334009,Johansson et al.,whole blood,62,female,7766148120,R06C01,7766148120_R06C01,,,2.62608698525751e-10,female,0.523480378568237,57.4260167862072,-4.57398321379276,0.98974013773705
GSM2334010,Johansson et al.,whole blood,47,female,7766148120,R04C01,7766148120_R04C01,,,1.79534119468691e-10,female,0.52726558627264,44.8357359089034,-2.1642640910966,0.991166809072674
GSM2334011,Johansson et al.,whole blood,44,male,7766148077,R02C01,7766148077_R02C01,,,0.99999331992867,male,0.520194600404634,41.5427459822649,-2.4572540177351,0.989917027842648
GSM2334012,Johansson et al.,whole blood,51,male,7766148120,R05C01,7766148120_R05C01,,,0.999999256097663,male,0.53241189028941,50.7651036694903,-0.234896330509699,0.988452513680431
GSM2334013,Johansson et al.,whole blood,53,male,9370847081,R01C02,9370847081_R01C02,,,0.999947466261229,male,0.520058963429678,47.5453890525971,-5.45461094740289,0.986229895039931
GSM2334014,Johansson et al.,whole blood,79,male,9370847081,R05C01,9370847081_R05C01,,senior,0.999997120350216,male,0.536134677450142,73.4662222404693,-5.53377775953066,0.987388730933991
GSM2334015,Johansson et al.,whole blood,,,7766148120,R01C02,7766148120_R01C02,,,3.92501880475585e-08,female,0.518401172339485,31.9560647286653,,0.990581050856896
GSM2334016,Johansson et al.,whole blood,68,female,7766148057,R01C01,7766148057_R01C01,,senior,3.86935558628343e-08,female,0.522916459274388,66.58931079746,-1.41068920253997,0.990291783033563
GSM2334017,Johansson et al.,whole blood,50,male,9370847092,R02C02,9370847092_R02C02,,,0.999980068864649,male,0.522858109163028,41.8915852398618,-8.10841476013819,0.987947240285068
GSM2334018,Johansson et al.,whole blood,20,male,7766148057,R02C01,7766148057_R02C01,,young,0.999993928508979,male,0.5218589275576,14.0232266363325,-5.97677336366752,0.989576550741716
GSM2334019,Johansson et al.,whole blood,73,male,7766148057,R01C02,7766148057_R01C02,,senior,0.999975378264611,male,0.52185776289172,59.5731773304161,-13.4268226695839,0.989738066965782
GSM2334020,Johansson et al.,whole blood,52,male,7766148057,R03C01,7766148057_R03C01,,,0.999994017961935,male,0.520173221416241,43.7162943475676,-8.28370565243243,0.99063868342651
GSM2334021,Johansson et al.,whole blood,55,female,7766148057,R02C02,7766148057_R02C02,,,1.82173676316825e-08,female,0.528914265159606,48.4002225616837,-6.59977743831627,0.990382898609991
GSM2334022,Johansson et al.,whole blood,22,female,7766148057,R04C01,7766148057_R04C01,,young,7.32639001941108e-10,female,0.522840245075096,12.5807279606537,-9.41927203934629,0.989264724238437
GSM2334023,Johansson et al.,whole blood,27,male,7766148057,R03C02,7766148057_R03C02,,young,0.999993781941596,male,0.520900698519507,19.3265610665483,-7.67343893345172,0.99081599068423
GSM2334024,Johansson et al.,whole blood,15,female,7766148057,R05C01,7766148057_R05C01,,young,2.86365845092717e-10,female,0.529583825210302,7.49880505207719,-7.50119494792281,0.989446131603435
GSM2334025,Johansson et al.,whole blood,26,female,9370847092,R03C02,9370847092_R03C02,,young,1.38239071312923e-08,female,0.531621597142477,18.022070025963,-7.97792997403704,0.986372551769663
GSM2334026,Johansson et al.,whole blood,47,male,7766148057,R06C01,7766148057_R06C01,,,0.999998684982964,male,0.535210606881485,41.2778420835192,-5.72215791648078,0.989597031437007
GSM2334027,Johansson et al.,whole blood,43,female,7766148057,R04C02,7766148057_R04C02,,,1.55554508276479e-09,female,0.523098132002752,33.3386690904952,-9.66133090950477,0.989879849482746